{"text_format":"1","workbook":"xlsx","n_sheets":11,"sheets":["Error","All Systems","Report Template","Summary","Duct Details (Template)","Duct Details (170)","Fan Details","Help Guide","Report","Worksheet","Lists for Drop Down Selectors"],"not_rendered":{"charts":0,"images":23,"macros":1,"external_links":0,"defined_names":95,"comments":4,"pivot_tables":0},"unopened":[],"bounds":{"document_bytes":16777216,"sheet_cells":100000,"rows_first":2000,"rows_last":500,"rows_between":2000,"halvings":0,"cell_chars":16384,"cell_head_chars":4096},"cells_cut":0,"cells_raw":0,"read":"whole","date_system":"1900"}

{"sheet":"Error","index":0,"n_rows":3,"n_cols":1,"rows_kept":3,"cut":false,"hidden":false,"merged":[]}
[]
["Calculator"]
["The Fan System Calculator requires macros to function. Please choose Enable Macros when opening the workbook. If this option is not available, then please see your IT administrator to ensure you have the appropriate privileges to enable macros.\nThe navigation ribbon above relies upon the macros to function, and so will be non-responsive. Please close the workbook using the close button within the title bar in the top right corner, or use the File menu (which does not depend on macros) to select Close.\nYou can then re-open the workbook, this time choosing to enable macros.\n\nThis sheet will also appear while the Calculator is loading. Please wait a few seconds to allow it to initialise."]

{"sheet":"All Systems","index":1,"n_rows":23,"n_cols":46,"rows_kept":23,"cut":false,"hidden":true,"merged":[[14,20,14,21],[4,1,4,6],[5,1,5,6],[3,1,3,12],[3,14,3,21],[4,15,4,16],[4,18,4,19],[4,20,4,21],[5,20,5,21],[4,11,4,12],[5,11,5,12],[4,9,4,10],[5,9,5,10],[4,7,4,8],[5,7,5,8],[5,18,5,19],[5,15,5,16],[23,1,23,3],[18,1,18,21],[17,1,17,21],[20,1,20,21],[10,6,11,7],[13,20,13,21],[10,3,11,3],[10,17,10,19],[10,20,11,21],[10,1,11,1],[10,2,11,2],[10,4,11,4],[12,20,12,21],[10,8,10,10],[9,1,9,45],[10,39,10,41],[10,42,10,45],[10,5,11,5],[10,36,10,38],[10,11,10,13],[10,14,10,16]]}
[]
[null,null,null,null,null,null,null,null,null,null,null,null,null,null,null,null,null,null,null,null,null,"Calculator  "]
[]
[null,"Project Information",null,null,null,null,null,null,null,null,null,null,null,null,"Colour Guide"]
[null,"Building Name and Description",null,null,null,null,null,"Project Number",null,"Designer",null,"Company",null,null,"Input","Calculated",null,"N/A","Compliant",null,"Non-compliant"]
[null,null,null,null,null,null,null,null,null,null,null,null,null,null,"Gold","White",null,"Grey","Green",null,"Red"]
[]
[null,null,null,null,null,"Formula reference","VBA reference","Row number"]
[null,null,"Active System",1,"Duct Spreadsheet References",{"$f":"CONCATENATE(\"'\",G9,\"'\")","v":"'Duct Details (170)'"},"Duct Details (170)",{"$f":"14+Active_System_Number","v":15},null,"Next ID Number",174]
[null,"Systems"]
[null,"Controls","ID","System Description","Fan Tag","Flow Rate (L/s)","Configuration",null,"Straight Duct PD (Pa)",null,null,"Fitting PD (Pa)",null,null,"Efficiency (%)",null,null,"Motor Input Power (kW)",null,null,"Summary",null,"Dummy",{"$f":"Summary!B9","v":"Fan Type"},{"$f":"Summary!D9","v":"Fan Inlet"},{"$f":"Summary!E9","v":"Fan Outlet"},{"$f":"Summary!F9","v":"Fouling Risk"},"Dummy",{"$f":"Summary!C15","v":"Role"},{"$f":"'Fan Details'!C17","v":"Design Static Pressure Pa"},{"$f":"'Fan Details'!B21","v":"Motor Input Power"},{"$f":"'Fan Details'!C21","v":"System Total Efficiency"},"Duct Worksheet name (VBA)","Duct worksheet name (Excel)","Active & Compliant","Summary","Basic Requirements",null,null,"Component Requirements",null,null,"System Requirements"]
[null,null,null,null,null,null,null,null,"Calculated","Allowable",null,"Calculated","Allowable",null,"Calculated","Allowable",null,"Calculated","Allowable",null,null,null,null,null,null,null,null,null,null,null,null,null,null,null,null,null,{"$f":"Summary!B20","v":"Requirements Applicable"},{"$f":"Summary!C20","v":0},{"$f":"Summary!D20","v":0},{"$f":"Summary!B24","v":"Index Run"},{"$f":"Summary!C24","v":"Fan"},{"$f":"Summary!D24","v":"Overall"},{"$f":"Summary!B28","v":"Efficiency"},{"$f":"Summary!C28","v":"Pressure Drop"},{"$f":"Summary!D28","v":"Motor Power"},{"$f":"Summary!E28","v":"Overall"}]
[null,null,2,null,null,null,"Incomplete",null,"TBC","TBC",null,"TBC","TBC",null,null,"TBC",null,"TBC","TBC",null,"Insufficient Information",null,null,"-Select-","-Select-","-Select-","-Select-",null,"-Select-",null,null,null,"Duct Details (160)",{"$f":"CONCATENATE(\"'\",AG13,\"'\")","v":"'Duct Details (160)'"},{"$f":"CONCATENATE(IF(Active_System_Number=C13,1,0),U13)","v":"0Insufficient Information"},"More data is required before it can be determined whether the requirements are applicable to the system.\r\n\r\nMore data is required before the length of flexible duct can be evaluated.\r\nMore data is required before the index run's straight duct can be evaluated.\r\nMore data is required before the duct fittings in the index run can be evaluated.\r\nMore data is required before the index run can be evaluated.\r\nMore data is required before the fan's efficiency can be evaluated.\r\n","Insufficient Information",null,null,"Insufficient Information","Insufficient Information","Insufficient Information","Insufficient Information","Insufficient Information","Insufficient Information","Insufficient Information"]
[null,null,1,"ABC","XYZ",5000,"Complete",null,0.38320082079850321,5,null,60.904249286156983,75.904249286156983,null,0.45,0.35138258823251323,null,1.6666666666666667,2.8176095176214773,null,"Satisfies Part J5.4",null,null,"Axial - other","Ducted","Ducted","No",null,"Any other air-conditioning or ventilation fan",150,2,0.45,"Duct Details (169)",{"$f":"CONCATENATE(\"'\",AG14,\"'\")","v":"'Duct Details (169)'"},"1Satisfies Part J5.4","The fan system satisfies Part J5.4 on both component and systemic levels.\r\n\r\nThe length of flexible duct in the index run satisfies Part J5.4.\r\nThe sections of straight duct in the index run have an average pressure drop which satisfies Part J5.4.\r\nThe duct fittings in the index run satisfy the DTS Provisions of Part J5.4.\r\nConsidering these elements, the index run satisfies Part J5.4 on a component level.\r\nThe fan's efficiency satisfies Part J5.4 on a component level.\r\n\r\nThis calculator does not check whether the upstream connections to ductwork bends, elbows and tees in the index run have an equivalent diameter to the connected duct per J5.4(c)(iii). Ensure you check whether your system satisfies this provision, and if not, make suitable allowances in systemic energy usage calculations for the pressure drop differences which would result.","Applicable",null,null,"Satisfies Part J5.4","Satisfies Part J5.4","Satisfies Part J5.4",-0.21914980392774841,-0.24246933074945431,-0.40848202838496739,"Satisfies Part J5.4"]
[null,null,1,null,null,null,"Incomplete",null,"TBC","TBC",null,"TBC","TBC",null,null,"TBC",null,"TBC","TBC",null,"Insufficient Information",null,null,"-Select-","-Select-","-Select-","-Select-",null,"-Select-",null,null,null,"Duct Details (170)",{"$f":"CONCATENATE(\"'\",AG15,\"'\")","v":"'Duct Details (170)'"},{"$f":"CONCATENATE(IF(Active_System_Number=C15,1,0),U15)","v":"1Insufficient Information"},"More data is required before it can be determined whether the requirements are applicable to the system.\r\n\r\nMore data is required before the length of flexible duct can be evaluated.\r\nMore data is required before the index run's straight duct can be evaluated.\r\nMore data is required before the duct fittings in the index run can be evaluated.\r\nMore data is required before the index run can be evaluated.\r\nMore data is required before the fan's efficiency can be evaluated.\r\n","Insufficient Information",null,null,"Insufficient Information","Insufficient Information","Insufficient Information","Insufficient Information","Insufficient Information","Insufficient Information","Insufficient Information"]
{"$rows_left_out":9}
{"sheet":"Report Template","index":2,"n_rows":40,"n_cols":5,"rows_kept":40,"cut":false,"hidden":true,"merged":[[11,1,11,2],[32,3,32,4],[33,3,33,4],[31,0,31,4],[24,0,24,1],[39,1,39,4],[36,0,36,4],[3,0,3,4],[4,0,4,1],[5,0,5,1],[25,0,25,1],[35,0,35,4],[27,0,27,2],[7,0,7,2],[12,1,12,2],[13,1,13,2],[14,1,14,2],[16,0,16,2],[8,1,8,2],[9,1,9,2],[10,1,10,2]]}
[]
[null,null,null,null,"Calculator"]
[]
["Project Information"]
[{"$f":"'All Systems'!B5","v":"Building Name and Description"},null,{"$f":"'All Systems'!H5","v":"Project Number"},{"$f":"'All Systems'!J5","v":"Designer"},{"$f":"'All Systems'!L5","v":"Company"}]
[{"$f":"IF('All Systems'!B6=\"\",\"\",'All Systems'!B6)","v":""},null,{"$f":"IF('All Systems'!H6=\"\",\"\",'All Systems'!H6)","v":""},{"$f":"IF('All Systems'!J6=\"\",\"\",'All Systems'!J6)","v":""},{"$f":"IF('All Systems'!L6=\"\",\"\",'All Systems'!L6)","v":""}]
[]
["System Information"]
["Fan Tag:"]
["Description:"]
["Type:"]
["Role:"]
["Inlet:"]
["Outlet:"]
["Flow Rate:"]
{"$rows_left_out":26}
{"sheet":"Summary","index":3,"n_rows":40,"n_cols":6,"rows_kept":40,"cut":false,"hidden":true,"merged":[[45,0,45,2],[7,1,7,4],[4,1,4,2],[5,1,5,2],[3,1,3,5],[26,1,26,4],[33,1,33,5],[22,1,22,3],[8,1,8,2],[9,1,9,2],[32,1,32,5],[15,2,15,3],[14,2,14,3],[19,1,19,2],[20,1,20,2],[13,1,13,3]]}
[]
[null,null,null,null,null,"Calculator"]
[]
[null,"System General Information"]
[null,"Building Name and Description",null,"Project Number","Fan Tag","System Description"]
[null,{"$f":"IF('All Systems'!B6=\"\",\"\",'All Systems'!B6)","v":""},null,{"$f":"IF('All Systems'!H6=\"\",\"\",'All Systems'!H6)","v":""},{"$f":"IF(INDIRECT(\"'All Systems'!E\" & Active_System_RowNo)=\"\",\"\",INDIRECT(\"'All Systems'!E\" & Active_System_RowNo))","v":""},{"$f":"IF(INDIRECT(\"'All Systems'!D\" & Active_System_RowNo)=\"\",\"\",INDIRECT(\"'All Systems'!D\" & Active_System_RowNo))","v":""}]
[]
[null,"System Characteristics"]
[null,"Fan Type",null,"Fan Inlet","Fan Outlet","Fouling Risk"]
[null,"-Select-",null,"-Select-","-Select-","-Select-"]
[]
[null,"Installation Type",{"$f":"IFERROR(INDEX('Lists for Drop Down Selectors'!C36:E38,HLOOKUP(D10,'Lists for Drop Down Selectors'!C34:E35,2,FALSE),HLOOKUP(Summary!E10,'Lists for Drop Down Selectors'!C34:E35,2,FALSE)),\"N/A\")","v":"N/A"},null,null,{"$f":"IFERROR(VLOOKUP(F10,'Lists for Drop Down Selectors'!H4:I7,2,FALSE),\"B\")","v":"B"}]
[]
[null,"Fan Characteristics"]
[null,"Flow Rate L/s","Role"]
{"$rows_left_out":26}
{"sheet":"Duct Details (Template)","index":4,"n_rows":32,"n_cols":40,"rows_kept":32,"cut":false,"hidden":true,"merged":[[5,10,5,15],[4,10,4,15],[4,7,4,9],[4,1,4,6],[5,1,5,6],[3,1,3,15],[5,7,5,9],[29,7,29,8],[28,9,28,11],[29,9,29,11],[27,1,27,11],[23,1,23,2],[29,1,29,2],[28,1,28,2],[28,5,28,6],[29,5,29,6],[28,3,28,4],[29,3,29,4],[24,1,24,2],[25,1,25,2],[22,1,22,2],[28,7,28,8],[7,1,7,7],[8,1,8,4],[9,1,9,4],[21,1,21,4],[11,1,11,38]]}
[]
[null,null,null,null,null,null,null,null,null,null,null,null,null,null,null,null,null,null,null,null,null,"Calculator  ",null,null,null,null,null,null,null,null,null,null,null,null,null,null,null,null,null,"Calculator"]
[]
[null,"System General Information"]
[null,{"$f":"Summary!B5","v":"Building Name and Description"},null,null,null,null,null,{"$f":"Summary!E5","v":"Fan Tag"},null,null,{"$f":"Summary!F5","v":"System Description"}]
[null,{"$f":"IF(Summary!B6=\"\",\"\",Summary!B6)","v":""},null,null,null,null,null,{"$f":"IF(Summary!E6=\"\",\"\",Summary!E6)","v":""},null,null,{"$f":"IF(Summary!F6=\"\",\"\",Summary!F6)","v":""}]
[]
[null,"System Characteristics"]
[null,{"$f":"Summary!B9","v":"Fan Type"},null,null,null,{"$f":"Summary!D9","v":"Fan Inlet"},{"$f":"Summary!E9","v":"Fan Outlet"},{"$f":"Summary!F9","v":"Fouling Risk"}]
[null,{"$f":"IF(Summary!B10=\"\",\"\",Summary!B10)","v":"-Select-"},null,null,null,{"$f":"IF(Summary!D10=\"\",\"\",Summary!D10)","v":"-Select-"},{"$f":"IF(Summary!E10=\"\",\"\",Summary!E10)","v":"-Select-"},{"$f":"IF(Summary!F10=\"\",\"\",Summary!F10)","v":"-Select-"}]
[]
[null,"Index Run Details"]
[null,"ID","Description","Duct Shape","Component Type","Fitting Type","Specific Fitting","Temperature","Flow Rate","Width","Height","Diameter","Length","Roughness","Fitting Loss Coefficient Kt","Pressure Drop","Straight Pressure Drop","Allowable Pressure Drop","Fitting Pressure Drop","Allowable Fitting PD","Fitting Type Code",null,null,"Equivalent Diameter (PD)","Equivalent Diameter (Velocity)","Flow Rate For Iterative Solving","Fluid Density","Absolute Viscosity","Velocity","Total Straight PD","Compliant","Length of Flex"]
[null,null,null,null,null,null,null,"°C","L/s","mm","mm","mm","m","mm",null,"Pa","Pa/m","Pa","Pa","Pa",null,null,null,"m","m","L/s","kg/m³","kg/ms","m/s","Pa"]
[null,"Controls",{"$f":"IF(ISBLANK(B14),B13,B13 & CHAR(10) & B14)","v":"ID"},"Description","Duct Shape","Component Type","Fitting Type","Specific Fitting","Temperature\n°C","Flow Rate\nL/s","Width\nmm","Height\nmm","Diameter\nmm","Length\nm","Roughness\nmm","Fitting Loss Coefficient Kt",{"$f":"IF(ISBLANK(P14),P13,P13 & CHAR(10) & P14)","v":"Pressure Drop\nPa"},{"$f":"IF(ISBLANK(Q14),Q13,Q13 & CHAR(10) & Q14)","v":"Straight Pressure Drop\nPa/m"},{"$f":"IF(ISBLANK(R14),R13,R13 & CHAR(10) & R14)","v":"Allowable Pressure Drop\nPa"},"Fitting Pressure Drop\nPa","Allowable Fitting PD\nPa",{"$f":"IF(ISBLANK(U14),U13,U13 & CHAR(10) & U14)","v":"Fitting Type Code"},"Internal Reference","Ready for DP Calc","Equivalent Diameter (PD)\nm","Equivalent Diameter (Velocity)\nm","Flow Rate For Iterative Solving\nL/s","Fluid Density\nkg/m³","Absolute Viscosity\nkg/ms","Velocity\nm/s",{"$f":"IF(ISBLANK(AD14),AD13,AD13 & CHAR(10) & AD14)","v":"Total Straight PD\nPa"},"Satisfactory",{"$f":"IF(ISBLANK(AF14),AF13,AF13 & CHAR(10) & AF14)","v":"Length of Flex"},"Reynolds Number","Pressure Drop Formula To Copy","Compliant fitting PD to copy","Type+Compliance","Filter alternate maximum","Lastref"]
{"$rows_left_out":18}
{"sheet":"Duct Details (170)","index":5,"n_rows":32,"n_cols":40,"rows_kept":32,"cut":false,"hidden":true,"merged":[[29,1,29,2],[29,3,29,4],[29,5,29,6],[29,7,29,8],[29,9,29,11],[23,1,23,2],[24,1,24,2],[25,1,25,2],[27,1,27,11],[28,1,28,2],[28,3,28,4],[28,5,28,6],[28,7,28,8],[28,9,28,11],[22,1,22,2],[3,1,3,15],[4,1,4,6],[4,7,4,9],[4,10,4,15],[5,1,5,6],[5,7,5,9],[5,10,5,15],[7,1,7,7],[8,1,8,4],[9,1,9,4],[11,1,11,38],[21,1,21,4]]}
[]
[null,null,null,null,null,null,null,null,null,null,null,null,null,null,null,null,null,null,null,null,null,"Calculator  ",null,null,null,null,null,null,null,null,null,null,null,null,null,null,null,null,null,"Calculator"]
[]
[null,"System General Information"]
[null,{"$f":"Summary!B5","v":"Building Name and Description"},null,null,null,null,null,{"$f":"Summary!E5","v":"Fan Tag"},null,null,{"$f":"Summary!F5","v":"System Description"}]
[null,{"$f":"IF(Summary!B6=\"\",\"\",Summary!B6)","v":""},null,null,null,null,null,{"$f":"IF(Summary!E6=\"\",\"\",Summary!E6)","v":""},null,null,{"$f":"IF(Summary!F6=\"\",\"\",Summary!F6)","v":""}]
[]
[null,"System Characteristics"]
[null,{"$f":"Summary!B9","v":"Fan Type"},null,null,null,{"$f":"Summary!D9","v":"Fan Inlet"},{"$f":"Summary!E9","v":"Fan Outlet"},{"$f":"Summary!F9","v":"Fouling Risk"}]
[null,{"$f":"IF(Summary!B10=\"\",\"\",Summary!B10)","v":"-Select-"},null,null,null,{"$f":"IF(Summary!D10=\"\",\"\",Summary!D10)","v":"-Select-"},{"$f":"IF(Summary!E10=\"\",\"\",Summary!E10)","v":"-Select-"},{"$f":"IF(Summary!F10=\"\",\"\",Summary!F10)","v":"-Select-"}]
[]
[null,"Index Run Details"]
[null,"ID","Description","Duct Shape","Component Type","Fitting Type","Specific Fitting","Temperature","Flow Rate","Width","Height","Diameter","Length","Roughness","Fitting Loss Coefficient Kt","Pressure Drop","Straight Pressure Drop","Allowable Pressure Drop","Fitting Pressure Drop","Allowable Fitting PD","Fitting Type Code",null,null,"Equivalent Diameter (PD)","Equivalent Diameter (Velocity)","Flow Rate For Iterative Solving","Fluid Density","Absolute Viscosity","Velocity","Total Straight PD","Compliant","Length of Flex"]
[null,null,null,null,null,null,null,"°C","L/s","mm","mm","mm","m","mm",null,"Pa","Pa/m","Pa","Pa","Pa",null,null,null,"m","m","L/s","kg/m³","kg/ms","m/s","Pa"]
[null,"Controls",{"$f":"IF(ISBLANK(B14),B13,B13 & CHAR(10) & B14)","v":"ID"},"Description","Duct Shape","Component Type","Fitting Type","Specific Fitting","Temperature\n°C","Flow Rate\nL/s","Width\nmm","Height\nmm","Diameter\nmm","Length\nm","Roughness\nmm","Fitting Loss Coefficient Kt",{"$f":"IF(ISBLANK(P14),P13,P13 & CHAR(10) & P14)","v":"Pressure Drop\nPa"},{"$f":"IF(ISBLANK(Q14),Q13,Q13 & CHAR(10) & Q14)","v":"Straight Pressure Drop\nPa/m"},{"$f":"IF(ISBLANK(R14),R13,R13 & CHAR(10) & R14)","v":"Allowable Pressure Drop\nPa"},"Fitting Pressure Drop\nPa","Allowable Fitting PD\nPa",{"$f":"IF(ISBLANK(U14),U13,U13 & CHAR(10) & U14)","v":"Fitting Type Code"},"Internal Reference","Ready for DP Calc","Equivalent Diameter (PD)\nm","Equivalent Diameter (Velocity)\nm","Flow Rate For Iterative Solving\nL/s","Fluid Density\nkg/m³","Absolute Viscosity\nkg/ms","Velocity\nm/s",{"$f":"IF(ISBLANK(AD14),AD13,AD13 & CHAR(10) & AD14)","v":"Total Straight PD\nPa"},"Satisfactory",{"$f":"IF(ISBLANK(AF14),AF13,AF13 & CHAR(10) & AF14)","v":"Length of Flex"},"Reynolds Number","Pressure Drop Formula To Copy","Compliant fitting PD to copy","Type+Compliance","Filter alternate maximum","Lastref"]
{"$rows_left_out":18}
{"sheet":"Fan Details","index":6,"n_rows":37,"n_cols":7,"rows_kept":37,"cut":false,"hidden":true,"merged":[[36,1,36,4],[30,1,30,2],[16,3,17,5],[15,1,15,5],[20,3,22,5],[19,1,19,5],[4,4,4,5],[5,4,5,5],[3,1,3,5],[12,2,12,3],[13,2,13,3],[11,1,11,3],[9,1,9,2],[8,1,8,2],[4,1,4,2],[5,1,5,2],[7,1,7,5]]}
[]
[null,null,null,null,null,null,"Calculator"]
[]
[null,"System General Information"]
[null,{"$f":"Summary!B5","v":"Building Name and Description"},null,{"$f":"Summary!E5","v":"Fan Tag"},{"$f":"Summary!F5","v":"System Description"}]
[null,{"$f":"IF(Summary!B6=\"\",\"\",Summary!B6)","v":""},null,{"$f":"IF(Summary!E6=\"\",\"\",Summary!E6)","v":""},{"$f":"IF(Summary!F6=\"\",\"\",Summary!F6)","v":""}]
[]
[null,{"$f":"Summary!B8","v":"System Characteristics"}]
[null,{"$f":"Summary!B9","v":"Fan Type"},null,{"$f":"Summary!D9","v":"Fan Inlet"},{"$f":"Summary!E9","v":"Fan Outlet"},{"$f":"Summary!F9","v":"Fouling Risk"}]
[null,{"$f":"IF(Summary!B10=\"\",\"\",Summary!B10)","v":"-Select-"},null,{"$f":"IF(Summary!D10=\"\",\"\",Summary!D10)","v":"-Select-"},{"$f":"IF(Summary!E10=\"\",\"\",Summary!E10)","v":"-Select-"},{"$f":"IF(Summary!F10=\"\",\"\",Summary!F10)","v":"-Select-"}]
[]
[null,"Fan Characteristics"]
[null,{"$f":"Summary!B15","v":"Flow Rate L/s"},{"$f":"Summary!C15","v":"Role"}]
[null,{"$f":"Summary!B16","v":0},{"$f":"Summary!C16","v":"-Select-"}]
[]
{"$rows_left_out":23}
{"sheet":"Help Guide","index":7,"n_rows":246,"n_cols":3,"rows_kept":246,"cut":false,"hidden":true,"merged":[[6,1,6,2],[3,1,3,2],[4,1,4,2],[5,1,5,2],[199,1,199,2],[7,1,7,2],[8,1,8,2],[9,1,9,2],[10,1,10,2],[11,1,11,2],[12,1,12,2],[13,1,13,2],[15,1,15,2],[61,1,61,2],[113,1,113,2],[116,1,116,2]]}
[]
[]
[]
[null,"Table of Contents"]
[null,"Technical Information"]
[null,"Information on the calculator, its configuration and operation"]
[null,"How To Use The Calculator"]
[null,"A step-by-step guide to using the calculator"]
[null,"Calculation Details"]
[null,"Background engineering information on how the calculator performs its operations"]
[null,"Change Log"]
[null,"A list of changes made by each update to the calculator"]
[null,"Return to All Systems"]
[null,"Leave the guide and return to the All Systems sheet"]
[]
{"$rows_left_out":232}
{"sheet":"Report","index":8,"n_rows":40,"n_cols":5,"rows_kept":40,"cut":false,"hidden":true,"merged":[[39,1,39,4],[3,0,3,4],[4,0,4,1],[5,0,5,1],[7,0,7,2],[24,0,24,1],[8,1,8,2],[9,1,9,2],[10,1,10,2],[11,1,11,2],[14,1,14,2],[16,0,16,2],[12,1,12,2],[13,1,13,2],[25,0,25,1],[27,0,27,2],[35,0,35,4],[36,0,36,4],[31,0,31,4],[32,3,32,4],[33,3,33,4]]}
[]
[null,null,null,null,"Calculator"]
[]
["Project Information"]
["Building Name and Description",null,"Project Number","Designer","Company"]
["",null,"","",""]
[]
["System Information"]
["Fan Tag:"]
["Description:"]
["Type:","-Select-"]
["Role:","-Select-"]
["Inlet:","-Select-"]
["Outlet:","-Select-"]
["Flow Rate:"," L/s"]
{"$rows_left_out":26}
{"sheet":"Worksheet","index":9,"n_rows":5,"n_cols":1,"rows_kept":5,"cut":false,"hidden":true,"merged":[]}
["User's worksheet:"]
["This worksheet has been added for recording notes and making calculations (where desired)."]
["To maintain the integrity of the Calculator, this sheet is protected, which may cause some unavoidable restrictions on the functions available."]
["All cells below row 5 are accessible for user input, editing and formatting, subject to the limitations due to protection."]
["Use of this worksheet and responsibility for its contents and consequences remains entirely with the user."]

{"sheet":"Lists for Drop Down Selectors","index":10,"n_rows":148,"n_cols":10,"rows_kept":148,"cut":false,"hidden":true,"merged":[[20,1,20,4],[20,6,20,7],[20,8,20,9],[36,0,37,0],[32,2,32,3]]}
["This sheet is used to populate the options available. It should not be visible to regular users. If you see this, your calculator is malfunctioning  -the ABCB suggest that you return to our website and download a fresh copy."]
[]
["Types of Duct","Case Digit",null,null,"Types of Speed Control",null,null,"Fouling Risk"]
["-Select-","Z",null,null,"-Select-","Z",null,"-Select-","B"]
["Straight Duct","A",null,null,"Variable Speed","A",null,"Yes","A"]
["Duct Fitting (Kt)","B",null,null,"Constant Speed (as required by Part F4)","A",null,"No","B"]
["Duct Fitting (PD)","C",null,null,"Constant Speed (not required by Part F4)","B",null,0,"B"]
[0,"Z",null,null,0,"Z"]
[]
["Duct Shapes","Case Digit",null,null,"Fan Roles"]
["-Select-","Z",null,null,"-Select-","Z"]
["Rectangular Duct","A",null,null,"Smoke spill only","A"]
["Circular Duct","B",null,null,"Smoke spill (also used for air-conditioning or ventilation)","B"]
["Circular Flexible Duct","C",null,null,"Kitchen exhaust","A"]
[0,"Z",null,null,"Process-related","A"]
{"$rows_left_out":133}